Target
Peroxisome proliferator-activated receptor delta
Ligand
BDBM50135774
Substrate
Meas. Tech.
ChEMBL_154027 (CHEMBL759297)
IC50
880±n/a nM
Citation
 Xu, YMayhugh, DSaeed, AWang, XThompson, RCDominianni, SJKauffman, RFSingh, JBean, JSBensch, WRBarr, RJOsborne, JMontrose-Rafizadeh, CZink, RWYumibe, NPHuang, NLuffer-Atlas, DRungta, DMaise, DEMantlo, NB Design and synthesis of a potent and selective triazolone-based peroxisome proliferator-activated receptor alpha agonist. J Med Chem 46:5121-4 (2003)  
Target
Name:
Peroxisome proliferator-activated receptor delta
Synonyms:
NR1C2 NUCI Nuclear receptor subfamily 1 group C member 2 PPAR-beta PPARD Peroxisome proliferator-activated receptor Peroxisome proliferator-activated receptor delta
Type:
Enzyme
Mol. Mass.:
49910.45
Organism:
Homo sapiens (Human)
Description:
Q03181
Residue:
441
  
Inhibitor
Name:
BDBM50135774
Synonyms:
2-{4-[3-(1-Cyclohexylmethyl-5-oxo-4-propyl-4,5-dihydro-1H-[1,2,4]triazol-3-yl)-propyl]-phenoxy}-2-methyl-propionic acid | CHEMBL149438
Type:
Small organic molecule
Emp. Form.:
C25H37N3O4
Mol. Mass.:
443.579
SMILES:
CCCn1c(CCCc2ccc(OC(C)(C)C(O)=O)cc2)nn(CC2CCCCC2)c1=O
: