Target
Peroxisomal acyl-coenzyme A oxidase 1
Ligand
BDBM50138626
Substrate
Meas. Tech.
ChEBML_154606
IC50
2000±n/a nM
Citation
 Koltun, DOMarquart, TAShenk, KDElzein, ELi, YNguyen, MKerwar, SZeng, DChu, NSoohoo, DHao, JMaydanik, VYLustig, DANg, KJFraser, HZablocki, JA New fatty acid oxidation inhibitors with increased potency lacking adverse metabolic and electrophysiological properties. Bioorg Med Chem Lett 14:549-52 (2003)  
Target
Name:
Peroxisomal acyl-coenzyme A oxidase 1
Synonyms:
ACOX1_RAT Acox Palmitoyl-CoA oxidase Peroxisomal acyl-CoA oxidase 1, B chain Peroxisomal acyl-coenzyme A oxidase 1
Type:
PROTEIN
Mol. Mass.:
74693.04
Organism:
Rattus norvegicus
Description:
ChEMBL_311972
Residue:
661
  
Inhibitor
Name:
BDBM50138626
Synonyms:
CHEMBL152947 | N-(4-Chloro-benzyl)-2-{4-[(R)-2-hydroxy-3-(2-methyl-benzothiazol-5-yloxy)-propyl]-piperazin-1-yl}-acetamide
Type:
Small organic molecule
Emp. Form.:
C24H29ClN4O3S
Mol. Mass.:
489.03
SMILES:
Cc1nc2cc(OC[C@H](O)CN3CCN(CC(=O)NCc4ccc(Cl)cc4)CC3)ccc2s1
: