Target
5-hydroxytryptamine receptor 1B
Ligand
BDBM50133460
Substrate
Meas. Tech.
ChEMBL_1347 (CHEMBL616532)
Ki
610±n/a nM
Citation
 Egle, IMacLean, NDemchyshyn, LEdwards, LSlassi, ATehim, A 3-(2-pyrrolidin-1-ylethyl)-5-(1,2,3,6-tetrahydropyridin-4-yl)-1H-indole derivatives as high affinity human 5-HT(1B/1D) ligands. Bioorg Med Chem Lett 14:727-9 (2004)  
Target
Name:
5-hydroxytryptamine receptor 1B
Synonyms:
5-HT-1B 5-HT1B 5HT1B_HUMAN HTR1DB Serotonin (5-HT) receptor Serotonin Receptor 1B
Type:
G Protein-Coupled Receptor (GPCR)
Mol. Mass.:
43579.17
Organism:
Homo sapiens (Human)
Description:
Receptor binding assays were performed using human clone stably expressed in CHO cells
Residue:
390
  
Inhibitor
Name:
BDBM50133460
Synonyms:
CHEMBL115415 | Dimethyl-{2-[5-(1-methyl-1,2,3,6-tetrahydro-pyridin-4-yl)-1H-indol-3-yl]-ethyl}-amine
Type:
Small organic molecule
Emp. Form.:
C18H25N3
Mol. Mass.:
283.4112
SMILES:
CN(C)CCc1c[nH]c2ccc(cc12)C1=CCN(C)CC1
: