Target
Follicle-stimulating hormone receptor
Ligand
BDBM50142657
Substrate
Meas. Tech.
ChEMBL_69355 (CHEMBL677591)
EC50
32±n/a nM
Citation
 Guo, TAdang, AEDong, GFitzpatrick, DGeng, PHo, KKJibilian, CHKultgen, SGLiu, RMcDonald, ESaionz, KWValenzano, KJvan Straten, NCXie, DWebb, ML Small molecule biaryl FSH receptor agonists. Part 2: Lead optimization via parallel synthesis. Bioorg Med Chem Lett 14:1717-20 (2004)  
Target
Name:
Follicle-stimulating hormone receptor
Synonyms:
FSH-R FSHR_HUMAN Follicle-stimulating hormone receptor LGR1
Type:
PROTEIN
Mol. Mass.:
78273.21
Organism:
Homo sapiens (Human)
Description:
ChEMBL_1351769
Residue:
695
  
Inhibitor
Name:
BDBM50142657
Synonyms:
(3S,6S)-1-Heptyl-4,6-dimethyl-3-(3',4',5'-trimethoxy-biphenyl-4-ylmethyl)-piperazine-2,5-dione | CHEMBL279759
Type:
Small organic molecule
Emp. Form.:
C29H40N2O5
Mol. Mass.:
496.6383
SMILES:
CCCCCCCN1[C@@H](C)C(=O)N(C)[C@@H](Cc2ccc(cc2)-c2cc(OC)c(OC)c(OC)c2)C1=O
: