Target
Glucagon receptor
Ligand
BDBM50144016
Substrate
Meas. Tech.
ChEBML_72991
Ki
9±n/a nM
Citation
 Kurukulasuriya, RSorensen, BKLink, JTPatel, JRJae, HSWinn, MXRohde, JRGrihalde, NDLin, CWOgiela, CAAdler, ALCollins, CA Biaryl amide glucagon receptor antagonists. Bioorg Med Chem Lett 14:2047-50 (2004)  
Target
Name:
Glucagon receptor
Synonyms:
GCGR GLR_HUMAN Glucagon receptor (GlucR)
Type:
Enzyme
Mol. Mass.:
54026.92
Organism:
Homo sapiens (Human)
Description:
P47871
Residue:
477
  
Inhibitor
Name:
BDBM50144016
Synonyms:
3-{4-[(Biphenyl-4-ylcarbamoyl)-(4-tert-butyl-phenyl)-methoxy]-benzoylamino}-propionic acid | CHEMBL64475
Type:
Small organic molecule
Emp. Form.:
C34H34N2O5
Mol. Mass.:
550.6442
SMILES:
CC(C)(C)c1ccc(cc1)C(Oc1ccc(cc1)C(=O)NCCC(O)=O)C(=O)Nc1ccc(cc1)-c1ccccc1
: