Target
Corticotropin-releasing factor receptor 1
Ligand
BDBM50144201
Substrate
Meas. Tech.
ChEMBL_51112 (CHEMBL664958)
Ki
460±n/a nM
Citation
 Huang, CQGrigoriadis, DELiu, ZMcCarthy, JRRamphal, JWebb, TWhitten, JPXie, MYChen, C Design, synthesis, and SAR of 2-dialkylamino-4-arylpyrimidines as potent and selective corticotropin-releasing factor(1) (CRF(1)) receptor antagonists. Bioorg Med Chem Lett 14:2083-6 (2004)  
Target
Name:
Corticotropin-releasing factor receptor 1
Synonyms:
CRF-R CRF1 CRFR1 CRH-R 1 CRHR1 Corticotropin-releasing factor receptor 1 (CRF-1) Corticotropin-releasing hormone receptor 1
Type:
Enzyme
Mol. Mass.:
50744.31
Organism:
Homo sapiens (Human)
Description:
P34998
Residue:
444
  
Inhibitor
Name:
BDBM50144201
Synonyms:
CHEMBL305354 | Dicyclopropylmethyl-[4-(2,4-dimethoxy-phenyl)-pyrimidin-2-yl]-propyl-amine
Type:
Small organic molecule
Emp. Form.:
C22H29N3O2
Mol. Mass.:
367.4846
SMILES:
CCCN(C(C1CC1)C1CC1)c1nccc(n1)-c1ccc(OC)cc1OC
: