Target
Integrin alpha-4/beta-7
Ligand
BDBM50105372
Substrate
Meas. Tech.
ChEMBL_217617 (CHEMBL820360)
IC50
14±n/a nM
Citation
 Lin, LSLanza, TJCastonguay, LAKamenecka, TMcCauley, EVan Riper, GEgger, LAMumford, RATong, XMacCoss, MSchmidt, JAHagmann, WK Bioisosteric replacement of anilide with benzoxazole: potent and orally bioavailable antagonists of VLA-4. Bioorg Med Chem Lett 14:2331-4 (2004)  
Target
Name:
Integrin alpha-4/beta-7
Synonyms:
Integrin α4β7 Integrin alpha-4/beta7 | Integrin alpha4beta7
Type:
Protein Complex
Mol. Mass.:
Description:
The assay uses stably transfected K562 cells expressing human alpha4beta7 integrin.
Components:
This complex has 2 components.
Component 1
Name:
Integrin alpha-4
Synonyms:
CD49 antigen-like family member D CD49d antigen ITA4_HUMAN Integrin alpha-4 Integrin alpha-IV VLA-4 integrin alpha 4 precursor | integrin alpha-4 precursor
Type:
Membrane Protein
Mol. Mass.:
114897.35
Organism:
Homo sapiens (Human)
Description:
P13612
Residue:
1032
  
Component 2
Name:
Integrin beta-7
Synonyms:
ITB7_HUMAN Integrin alpha-4/beta-7 Integrin beta7
Type:
Membrane Protein
Mol. Mass.:
86893.88
Organism:
Homo sapiens (Human)
Description:
P26010
Residue:
798
  
Inhibitor
Name:
BDBM50105372
Synonyms:
(S)-2-{[(S)-1-(3,5-Dichloro-benzenesulfonyl)-2-methyl-azetidine-2-carbonyl]-amino}-3-(2',6'-dimethoxy-biphenyl-4-yl)-propionic acid | CHEMBL309823
Type:
Small organic molecule
Emp. Form.:
C28H28Cl2N2O7S
Mol. Mass.:
607.502
SMILES:
COc1cccc(OC)c1-c1ccc(C[C@H](NC(=O)[C@]2(C)CCN2S(=O)(=O)c2cc(Cl)cc(Cl)c2)C(O)=O)cc1
: