Target
M-phase inducer phosphatase 2
Ligand
BDBM50147585
Substrate
Meas. Tech.
ChEBML_49024
IC50
1440±n/a nM
Citation
 Shimazawa, RSuzuki, TDodo, KShirai, R Design and synthesis of dysidiolide analogs from vitamin D3: novel class of Cdc25A inhibitors. Bioorg Med Chem Lett 14:3291-4 (2004)  
Target
Name:
M-phase inducer phosphatase 2
Synonyms:
CDC25B Dual specificity phosphatase (CDC25B) M-phase inducer phosphatase 2 (CDC25B) | MPIP2_HUMAN
Type:
Protein
Mol. Mass.:
64985.27
Organism:
Homo sapiens (Human)
Description:
Residue:
580
  
Inhibitor
Name:
BDBM50147585
Synonyms:
(R)-4-{2-[(3R,7R)-1-((2R,3R)-1,5-Dimethyl-hexyl)-4,7a-dimethyl-octahydro-inden-4-yl]-1-hydroxy-ethyl}-5-hydroxy-5H-furan-2-one | CHEMBL111717
Type:
Small organic molecule
Emp. Form.:
C25H42O4
Mol. Mass.:
406.5986
SMILES:
CC(C)CCC[C@@H](C)[C@H]1CCC2[C@]1(C)CCC[C@]2(C)C[C@@H](O)C1=CC(=O)OC1O
: