Target
Poly [ADP-ribose] polymerase 1
Ligand
BDBM50154728
Substrate
Meas. Tech.
ChEMBL_302465 (CHEMBL826331)
Ki
6.9±n/a nM
Citation
 Tikhe, JGWebber, SEHostomsky, ZMaegley, KAEkkers, ALi, JYu, XHAlmassy, RJKumpf, RABoritzki, TJZhang, CCalabrese, CRCurtin, NJKyle, SThomas, HDWang, LZCalvert, AHGolding, BTGriffin, RJNewell, DR Design, synthesis, and evaluation of 3,4-dihydro-2H-[1,4]diazepino[6,7,1-hi]indol-1-ones as inhibitors of poly(ADP-ribose) polymerase. J Med Chem 47:5467-81 (2004)  
Target
Name:
Poly [ADP-ribose] polymerase 1
Synonyms:
(ARTD1 or PARP1) 2.4.2.30 ADPRT ARTD1 Human diphtheria toxin-like ADP-ribosyltransferase (ARTD1 or PARP1) NT-PARP-1 PARP1 PPOL Poly [ADP-ribose] polymerase 1 (PARP) Poly [ADP-ribose] polymerase 1 (PARP1) Poly [ADP-ribose] polymerase 1, 28-kDa form Poly [ADP-ribose] polymerase 1, processed C-terminus Poly [ADP-ribose] polymerase-1 Poly(ADP-ribose) polymerase-1 (ARTD1/PARP1) Protein poly-ADP-ribosyltransferase PARP1 | Synonyms=ADPRT
Type:
Mol. Mass.:
113114.22
Organism:
Homo sapiens (Human)
Description:
P09874
Residue:
1014
  
Inhibitor
Name:
BDBM50154728
Synonyms:
6-(3-Methylaminomethyl-phenyl)-3,4-dihydro-2H-[1,4]diazepino[6,7,1-hi]indol-1-one | CHEMBL362111
Type:
Small organic molecule
Emp. Form.:
C19H19N3O
Mol. Mass.:
305.3737
SMILES:
CNCc1cccc(c1)-c1cc2cccc3C(=O)NCCn1c23
: