Target
Estrogen receptor
Ligand
BDBM50157488
Substrate
Meas. Tech.
ChEMBL_429939 (CHEMBL916819)
IC50
18±n/a nM
Citation
 Steffan, RJMatelan, EAshwell, MAMoore, WJSolvibile, WRTrybulski, EChadwick, CCChippari, SKenney, TEckert, ABorges-Marcucci, LKeith, JCXu, ZMosyak, LHarnish, DC Synthesis and activity of substituted 4-(indazol-3-yl)phenols as pathway-selective estrogen receptor ligands useful in the treatment of rheumatoid arthritis. J Med Chem 47:6435-8 (2004)  
Target
Name:
Estrogen receptor
Synonyms:
ER ESR ESR1_HUMAN Estrogen receptor Estrogen receptor (ER-alpha) Estrogen receptor alpha (ER) Nuclear receptor subfamily 3 group A member 1
Type:
Protein
Mol. Mass.:
66230.44
Organism:
Homo sapiens (Human)
Description:
P03372
Residue:
595
  
Inhibitor
Name:
BDBM50157488
Synonyms:
4-(7-chloro-1-cyclopentyl-1H-indazol-3-yl)phenol | CHEMBL222434
Type:
Small organic molecule
Emp. Form.:
C18H17ClN2O
Mol. Mass.:
312.793
SMILES:
Oc1ccc(cc1)-c1nn(C2CCCC2)c2c(Cl)cccc12
: