Target
Sterol O-acyltransferase 1
Ligand
BDBM50147177
Substrate
Meas. Tech.
ChEMBL_306239 (CHEMBL830336)
IC50
82000±n/a nM
Citation
 Jeong, TSKim, KSYu, HKim, MJCho, KHChoi, YKKim, HCPark, HYLee, WS Saucerneol B derivatives as human acyl-CoA: cholesterol acyltransferase inhibitors. Bioorg Med Chem Lett 15:385-8 (2004)  
Target
Name:
Sterol O-acyltransferase 1
Synonyms:
ACACT ACAT Acetyl-CoA acetyltransferase, mitochondrial Acyl-CoA: cholesterol acyltransferase (ACAT) Cholesterol acyltransferase 1 SOAT1 STAT
Type:
Multi-pass membrane protein may form homo- or heterodimers.
Mol. Mass.:
64751.94
Organism:
Homo sapiens (Human)
Description:
P35610
Residue:
550
  
Inhibitor
Name:
BDBM50147177
Synonyms:
2-(4-{(2S,3R,4R,5S)-5-[4-(2-Benzo[1,3]dioxol-5-yl-2-hydroxy-1-methyl-ethoxy)-3-methoxy-phenyl]-3,4-dimethyl-tetrahydro-furan-2-yl}-2-methoxy-phenoxy)-1-(3,4-dimethoxy-phenyl)-propan-1-ol | CHEMBL321124
Type:
Small organic molecule
Emp. Form.:
C41H48O11
Mol. Mass.:
716.8132
SMILES:
COc1ccc(cc1OC)C(O)C(C)Oc1ccc(cc1OC)[C@H]1O[C@@H]([C@H](C)[C@H]1C)c1ccc(OC(C)C(O)c2ccc3OCOc3c2)c(OC)c1
: