Target
Alpha-2C adrenergic receptor
Ligand
BDBM50163474
Substrate
Meas. Tech.
ChEMBL_302773 (CHEMBL852482)
Ki
0.500000±n/a nM
Citation
 Andrés, JIAlcázar, JAlonso, JMAlvarez, RMBakker, MHBiesmans, ICid, JMDe Lucas, AIFernández, JFont, LMHens, KAIturrino, LLenaerts, IMartínez, SMegens, AAPastor, JVermote, PCSteckler, T Discovery of a new series of centrally active tricyclic isoxazoles combining serotonin (5-HT) reuptake inhibition with alpha2-adrenoceptor blocking activity. J Med Chem 48:2054-71 (2005)  
Target
Name:
Alpha-2C adrenergic receptor
Synonyms:
ADA2C_HUMAN ADRA2L2 Adrenergic alpha2C Adrenergic receptor alpha Alpha-2 adrenergic receptor subtype C4 Alpha-2C adrenoreceptor | adrenergic, alpha-2C-, receptor [Homo sapiens]
Type:
Enzyme
Mol. Mass.:
49552.32
Organism:
Homo sapiens (Human)
Description:
P18825
Residue:
462
  
Inhibitor
Name:
BDBM50163474
Synonyms:
CHEMBL425324 | Isonicotinic acid (3R,3aS)-3-[4-((E)-2-methyl-3-phenyl-allyl)-piperazin-1-ylmethyl]-3a,4-dihydro-3H-chromeno[4,3-c]isoxazol-7-yl ester
Type:
Small organic molecule
Emp. Form.:
C31H32N4O4
Mol. Mass.:
524.6102
SMILES:
C\C(CN1CCN(C[C@@H]2ON=C3[C@H]2COc2cc(OC(=O)c4ccncc4)ccc32)CC1)=C/c1ccccc1
: