Target
Metabotropic glutamate receptor 2
Ligand
BDBM50170313
Substrate
Meas. Tech.
ChEMBL_304368 (CHEMBL829010)
EC50
2263±n/a nM
Citation
 Govek, SPBonnefous, CHutchinson, JHKamenecka, TMcQuiston, JPracitto, RZhao, LXGardner, MFJames, JKDaggett, LPRowe, BASchaffhauser, HBristow, LJCampbell, UCRodriguez, DEVernier, JM Benzazoles as allosteric potentiators of metabotropic glutamate receptor 2 (mGluR2): efficacy in an animal model for schizophrenia. Bioorg Med Chem Lett 15:4068-72 (2005)  
Target
Name:
Metabotropic glutamate receptor 2
Synonyms:
GPRC1B GRM2_HUMAN Metabotropic glutamate receptor mGlu2 | metabotropic glutamate 2
Type:
Enzyme
Mol. Mass.:
95584.88
Organism:
Homo sapiens (Human)
Description:
Q14416
Residue:
872
  
Inhibitor
Name:
BDBM50170313
Synonyms:
4-Bromo-1-(2,2-dimethyl-propyl)-5-{4-[4-(1H-tetrazol-5-yl)-phenoxy]-butoxy}-1H-indole | CHEMBL361934
Type:
Small organic molecule
Emp. Form.:
C24H28BrN5O2
Mol. Mass.:
498.415
SMILES:
CC(C)(C)Cn1ccc2c(Br)c(OCCCCOc3ccc(cc3)-c3nnn[nH]3)ccc12
: