Target
Gastrin/cholecystokinin type B receptor
Ligand
BDBM50170765
Substrate
Meas. Tech.
ChEMBL_306156 (CHEMBL832344)
IC50
>10000±n/a nM
Citation
 Martín-Martínez, MMarty, AJourdan, MEscrieut, CArcher, EGonzález-Muñiz, RGarcía-López, MTMaigret, BHerranz, RFourmy, D Combination of molecular modeling, site-directed mutagenesis, and SAR studies to delineate the binding site of pyridopyrimidine antagonists on the human CCK1 receptor. J Med Chem 48:4842-50 (2005)  
Target
Name:
Gastrin/cholecystokinin type B receptor
Synonyms:
CCK-2 receptor CCK-BR CCKRB Cholecystokinin receptor GASR_HUMAN | Gastrin/cholecystokinin type B receptor
Type:
G Protein-Coupled Receptor (GPCR)
Mol. Mass.:
48445.79
Organism:
Homo sapiens (Human)
Description:
Stable expression of human CCK-2 receptors in HEK 293 cells.
Residue:
447
  
Inhibitor
Name:
BDBM50170765
Synonyms:
CHEMBL363916 | [(S)-1-((4aS,5R)-2-Benzyl-1-mercapto-3-oxo-octahydro-pyrido[1,2-c]pyrimidin-5-ylcarbamoyl)-2-(1H-indol-3-yl)-ethyl]-carbamic acid tert-butyl ester
Type:
Small organic molecule
Emp. Form.:
C31H39N5O4S
Mol. Mass.:
577.737
SMILES:
CC(C)(C)OC(=O)N[C@@H](Cc1c[nH]c2ccccc12)C(=O)N[C@@H]1CCCN2C(S)N(Cc3ccccc3)C(=O)C[C@@H]12
: