Target
Histamine H3 receptor
Ligand
BDBM50175828
Substrate
Meas. Tech.
ChEMBL_327753 (CHEMBL861794)
Ki
0.2±n/a nM
Citation
 Vaccaro, WDSher, RBerlin, MShih, NYAslanian, RSchwerdt, JHMcCormick, KDPiwinski, JJWest, REAnthes, JCWilliams, SMWu, RLShe, HSRivelli, MAMutter, JCCorboz, MRHey, JAFavreau, L Novel histamine H3 receptor antagonists based on the 4-[(1H-imidazol-4-yl)methyl]piperidine scaffold. Bioorg Med Chem Lett 16:395-9 (2005)  
Target
Name:
Histamine H3 receptor
Synonyms:
HISTAMINE H3 HRH3_CAVPO | Histamine H3 receptor
Type:
Enzyme Catalytic Domain
Mol. Mass.:
48753.61
Organism:
GUINEA PIG
Description:
HISTAMINE H3 HRH3 GUINEA PIG::Q9JI35
Residue:
445
  
Inhibitor
Name:
BDBM50175828
Synonyms:
3-(4-((1H-imidazol-4-yl)methyl)piperidin-1-yl)-N-(3-fluorophenyl)propanamide | CHEMBL200382
Type:
Small organic molecule
Emp. Form.:
C18H23FN4O
Mol. Mass.:
330.3998
SMILES:
Fc1cccc(NC(=O)CCN2CCC(Cc3cnc[nH]3)CC2)c1
: