Target
Adenosine kinase
Ligand
BDBM50178027
Substrate
Meas. Tech.
ChEMBL_325687 (CHEMBL864546)
IC50
1±n/a nM
Citation
 Bookser, BCUgarkar, BGMatelich, MCLemus, RHAllan, MTsuchiya, MNakane, MNagahisa, AWiesner, JBErion, MD Adenosine kinase inhibitors. 6. Synthesis, water solubility, and antinociceptive activity of 5-phenyl-7-(5-deoxy-beta-D-ribofuranosyl)pyrrolo[2,3-d]pyrimidines substituted at C4 with glycinamides and related compounds. J Med Chem 48:7808-20 (2005)  
Target
Name:
Adenosine kinase
Synonyms:
ADK | ADK_HUMAN
Type:
PROTEIN
Mol. Mass.:
40545.97
Organism:
Homo sapiens (Human)
Description:
ChEMBL_1467841
Residue:
362
  
Inhibitor
Name:
BDBM50178027
Synonyms:
CHEMBL438449 | N-cyclopentyl-2-(5-phenyl-7-(5-deoxy-beta-D-ribofuranosyl)-pyrrolo[2,3-d]pyrimidin-4-ylamino)acetamide
Type:
Small organic molecule
Emp. Form.:
C24H29N5O4
Mol. Mass.:
451.5182
SMILES:
C[C@H]1O[C@H]([C@H](O)[C@@H]1O)n1cc(-c2ccccc2)c2c(NCC(=O)NC3CCCC3)ncnc12
: