Target
Peroxisome proliferator-activated receptor delta
Ligand
BDBM50184659
Substrate
Meas. Tech.
ChEMBL_355606 (CHEMBL853178)
EC50
90±n/a nM
Citation
 Epple, RAzimioara, MRusso, RBursulaya, BTian, SSGerken, AIskandar, M 1,3,5-Trisubstituted aryls as highly selective PPARdelta agonists. Bioorg Med Chem Lett 16:2969-73 (2006)  
Target
Name:
Peroxisome proliferator-activated receptor delta
Synonyms:
NR1C2 NUCI Nuclear receptor subfamily 1 group C member 2 PPAR-beta PPARD Peroxisome proliferator-activated receptor Peroxisome proliferator-activated receptor delta
Type:
Enzyme
Mol. Mass.:
49910.45
Organism:
Homo sapiens (Human)
Description:
Q03181
Residue:
441
  
Inhibitor
Name:
BDBM50184659
Synonyms:
CHEMBL208203 | {4-[4,6-bis-(4-trifluoromethoxy-phenyl)-pyrimidin-2-ylmethoxy]-2-methyl-phenoxy}-acetic acid
Type:
Small organic molecule
Emp. Form.:
C28H20F6N2O6
Mol. Mass.:
594.4586
SMILES:
Cc1cc(OCc2nc(cc(n2)-c2ccc(OC(F)(F)F)cc2)-c2ccc(OC(F)(F)F)cc2)ccc1OCC(O)=O
: