Target
Baculoviral IAP repeat-containing protein 5
Ligand
BDBM50209192
Substrate
Meas. Tech.
ChEMBL_443470 (CHEMBL893728)
Kd
1170±n/a nM
Citation
 Wendt, MDSun, CKunzer, ASauer, DSarris, KHoff, EYu, LNettesheim, DGChen, JJin, SComess, KMFan, YAnderson, SNIsaac, BOlejniczak, ETHajduk, PJRosenberg, SHElmore, SW Discovery of a novel small molecule binding site of human survivin. Bioorg Med Chem Lett 17:3122-9 (2007)  
Target
Name:
Baculoviral IAP repeat-containing protein 5
Synonyms:
API4 Apoptosis inhibitor survivin BIRC5_HUMAN | IAP4
Type:
PROTEIN
Mol. Mass.:
16386.52
Organism:
Homo sapiens (Human)
Description:
ChEMBL_443470
Residue:
142
  
Inhibitor
Name:
BDBM50209192
Synonyms:
6-(5-bromo-2-hydroxyphenyl)-4-(2,5-dimethylphenyl)-2-oxo-1,2-dihydropyridine-3-carbonitrile | CHEMBL236829
Type:
Small organic molecule
Emp. Form.:
C20H15BrN2O2
Mol. Mass.:
395.249
SMILES:
Cc1ccc(C)c(c1)-c1cc([nH]c(=O)c1C#N)-c1cc(Br)ccc1O
: