Target
Aurora kinase C
Ligand
BDBM50191405
Substrate
Meas. Tech.
ChEMBL_445191 (CHEMBL894339)
IC50
700±n/a nM
Citation
 Myrianthopoulos, VMagiatis, PFerandin, YSkaltsounis, ALMeijer, LMikros, E An integrated computational approach to the phenomenon of potent and selective inhibition of aurora kinases B and C by a series of 7-substituted indirubins. J Med Chem 50:4027-37 (2007)  
Target
Name:
Aurora kinase C
Synonyms:
AIE2 AIRK3 AURKC Aurora Kinase C (Aurora-C) Aurora kinase C (AURKC) Aurora-C/INCENP Aurora/Ipl1/Eg2 protein 2 Serine/threonine-protein kinase 13 | Serine/threonine-protein kinase Aurora-C
Type:
Enzyme
Mol. Mass.:
35602.43
Organism:
Homo sapiens (Human)
Description:
Amino acid residues 1-309 were expressed as His-tagged fusion protein using baculovirus expression system.
Residue:
309
  
Inhibitor
Name:
BDBM50191405
Synonyms:
(2'Z,3'E)-7-bromoindirubin-3'-oxime | CHEMBL373834
Type:
Small organic molecule
Emp. Form.:
C16H10BrN3O2
Mol. Mass.:
356.174
SMILES:
Oc1[nH]c2c(Br)cccc2c1-c1[nH]c2ccccc2c1N=O
: