Target
Phenylethanolamine N-methyltransferase
Ligand
BDBM13025
Substrate
Meas. Tech.
ChEMBL_446219 (CHEMBL895324)
Ki
39±n/a nM
Citation
 Gee, CLDrinkwater, NTyndall, JDGrunewald, GLWu, QMcLeish, MJMartin, JL Enzyme adaptation to inhibitor binding: a cryptic binding site in phenylethanolamine N-methyltransferase. J Med Chem 50:4845-53 (2007)  
Target
Name:
Phenylethanolamine N-methyltransferase
Synonyms:
Noradrenaline N-methyltransferase PNMT PNMTase | Phenylethanolamine N-Methyltransferase (PNMT)
Type:
Enzyme
Mol. Mass.:
30852.66
Organism:
Homo sapiens (Human)
Description:
Residue:
282
  
Inhibitor
Name:
BDBM13025
Synonyms:
7-sulfonamide-THIQ 15 N-(4-chlorophenyl)-3-(hydroxymethyl)-1,2,3,4-tetrahydroisoquinoline-7-sulfonamide
Type:
Small organic molecule
Emp. Form.:
C16H17ClN2O3S
Mol. Mass.:
352.836
SMILES:
OCC1Cc2ccc(cc2CN1)S(=O)(=O)Nc1ccc(Cl)cc1
: