Target
C-X-C chemokine receptor type 2
Ligand
BDBM50226997
Substrate
Meas. Tech.
ChEMBL_461466 (CHEMBL927478)
Ki
11±n/a nM
Citation
 Biju, PTaveras, AYu, YZheng, JChao, JRindgen, DJakway, JHipkin, RWFossetta, JFan, XFine, JQiu, HMerritt, JRBaldwin, JJ 3,4-Diamino-2,5-thiadiazole-1-oxides as potent CXCR2/CXCR1 antagonists. Bioorg Med Chem Lett 18:228-31 (2008)  
Target
Name:
C-X-C chemokine receptor type 2
Synonyms:
C-X-C chemokine receptor type 2 (CXCR-2) CD_antigen=CD182 CXCR-2 CXCR2_HUMAN GRO/MGSA receptor IL-8 receptor type 2 IL8RB | Interleukin-8 receptor B
Type:
Protein
Mol. Mass.:
40767.88
Organism:
Homo sapiens (Human)
Description:
P25025
Residue:
360
  
Inhibitor
Name:
BDBM50226997
Synonyms:
3-{4-[(R)-1-(3-fluoro-phenyl)-2-methyl-propylamino]-1,1-dioxo-1H-1lambda6-[1,2,5]thiadiazol-3-ylamino}-2-hydroxy-N,N-dimethyl-benzamide | CHEMBL402076
Type:
Small organic molecule
Emp. Form.:
C21H24FN5O4S
Mol. Mass.:
461.51
SMILES:
CC(C)[C@@H](NC1=NS(=O)(=O)NC1=Nc1cccc(C(=O)N(C)C)c1O)c1cccc(F)c1
: