Target
5-hydroxytryptamine receptor 6
Ligand
BDBM50251690
Substrate
Meas. Tech.
ChEMBL_488054 (CHEMBL983864)
Ki
19±n/a nM
Citation
 Liu, KGLo, JRComery, TAZhang, GMZhang, JYKowal, DMSmith, DLDi, LKerns, EHSchechter, LERobichaud, AJ A regiospecific synthesis of a series of 1-sulfonyl azepinoindoles as potent 5-HT6 ligands. Bioorg Med Chem Lett 18:3929-31 (2008)  
Target
Name:
5-hydroxytryptamine receptor 6
Synonyms:
5-HT-6 5-hydroxytryptamine receptor 6 (5-HT-6) 5-hydroxytryptamine receptor 6 (5HT6) HTR6 Serotonin 6 (5-HT6) receptor | Serotonin Receptor 6
Type:
G Protein-Coupled Receptor (GPCR)
Mol. Mass.:
46968.43
Organism:
Homo sapiens (Human)
Description:
P50406
Residue:
440
  
Inhibitor
Name:
BDBM50251690
Synonyms:
6-(2-chlorophenylsulfonyl)-1,2,3,4,5,6-hexahydroazepino[4,5-b]indole | CHEMBL471099
Type:
Small organic molecule
Emp. Form.:
C18H17ClN2O2S
Mol. Mass.:
360.858
SMILES:
Clc1ccccc1S(=O)(=O)n1c2CCNCCc2c2ccccc12
: