Target
Integrin alpha-IIb
Ligand
BDBM50253778
Substrate
Meas. Tech.
ChEMBL_511534 (CHEMBL980977)
IC50
12080±n/a nM
Citation
 Ilas, JJakopin, ZBorstnar, TStegnar, MKikelj, D 3,4-Dihydro-2H-1,4-benzoxazine derivatives combining thrombin inhibitory and glycoprotein IIb/IIIa receptor antagonistic activity as a novel class of antithrombotic compounds with dual function. J Med Chem 51:5617-29 (2008)  
Target
Name:
Integrin alpha-IIb
Synonyms:
CD_antigen=CD41 GPIIb Glycoprotein IIb ITGA2B Integrin alpha-IIb heavy chain Integrin alpha-IIb light chain, form 2 Integrin alpha-V/beta-3 and alpha-IIb/beta 3 | Platelet membrane glycoprotein IIb
Type:
Protein
Mol. Mass.:
113354.85
Organism:
Homo sapiens (Human)
Description:
P08514
Residue:
1039
  
Inhibitor
Name:
BDBM50253778
Synonyms:
2-(4-Carbamimidoylbenzyloxy)-4-methyl-3-oxo-N-phenyl-3,4-dihydro-2H-1,4-benzoxazine-7-carboxamide | CHEMBL461629
Type:
Small organic molecule
Emp. Form.:
C24H22N4O4
Mol. Mass.:
430.4559
SMILES:
CN1C(=O)C(OCc2ccc(cc2)C(N)=N)Oc2cc(ccc12)C(=O)Nc1ccccc1
: