Target
Muscarinic acetylcholine receptor M5
Ligand
BDBM50263892
Substrate
Meas. Tech.
ChEMBL_536132 (CHEMBL983586)
EC50
>50000±n/a nM
Citation
 Bridges, TMBrady, AEKennedy, JPDaniels, RNMiller, NRKim, KBreininger, MLGentry, PRBrogan, JTJones, CKConn, PJLindsley, CW Synthesis and SAR of analogues of the M1 allosteric agonist TBPB. Part I: Exploration of alternative benzyl and privileged structure moieties. Bioorg Med Chem Lett 18:5439-42 (2008)  
Target
Name:
Muscarinic acetylcholine receptor M5
Synonyms:
ACM5_HUMAN | CHRM5
Type:
PROTEIN
Mol. Mass.:
60102.35
Organism:
Homo sapiens (Human)
Description:
ChEMBL_1517990
Residue:
532
  
Inhibitor
Name:
BDBM50263892
Synonyms:
6-Fluoro-1-[1'-(2-methyl-benzyl)-[1,4']bipiperidinyl-4-yl]-1,3-dihydro-benzoimidazol-2-one | CHEMBL490797
Type:
Small organic molecule
Emp. Form.:
C25H31FN4O
Mol. Mass.:
422.5382
SMILES:
Cc1ccccc1CN1CCC(CC1)N1CCC(CC1)n1c2cc(F)ccc2[nH]c1=O
: