Target
C5a anaphylatoxin chemotactic receptor 1
Ligand
BDBM50275644
Substrate
Meas. Tech.
ChEMBL_496808 (CHEMBL1008821)
IC50
5±n/a nM
Citation
 Blagg, JMowbray, CPryde, DCSalmon, GSchmid, EFairman, DBeaumont, K Small, non-peptide C5a receptor antagonists: part 1. Bioorg Med Chem Lett 18:5601-4 (2008)  
Target
Name:
C5a anaphylatoxin chemotactic receptor 1
Synonyms:
C5AR C5AR1_HUMAN C5a anaphylatoxin chemotactic receptor C5a-R | CD_antigen=CD88
Type:
Enzyme
Mol. Mass.:
39347.68
Organism:
Homo sapiens (Human)
Description:
P21730
Residue:
350
  
Inhibitor
Name:
BDBM50275644
Synonyms:
CHEMBL520715 | cis-N-(4-chlorophenethyl)-N-(1-oxaspiro[4.5]decan-8-yl)benzo[b]thiophene-3-carboxamide
Type:
Small organic molecule
Emp. Form.:
C26H28ClNO2S
Mol. Mass.:
454.024
SMILES:
Clc1ccc(CCN([C@H]2CC[C@]3(CCCO3)CC2)C(=O)c2csc3ccccc23)cc1
: