Target
Histone deacetylase 3
Ligand
BDBM25162
Substrate
Meas. Tech.
ChEMBL_493210 (CHEMBL948440)
IC50
1400±n/a nM
Citation
 Scarpelli, RDi Marco, AFerrigno, FLaufer, RMarcucci, IMuraglia, EOntoria, JMRowley, MSerafini, SSteinkühler, CJones, P Studies of the metabolic stability in cells of 5-(trifluoroacetyl)thiophene-2-carboxamides and identification of more stable class II histone deacetylase (HDAC) inhibitors. Bioorg Med Chem Lett 18:6078-82 (2008)  
Target
Name:
Histone deacetylase 3
Synonyms:
HD3 HDAC3_HUMAN Human HDAC3 SMAP45
Type:
Enzyme
Mol. Mass.:
48829.55
Organism:
Homo sapiens (Human)
Description:
O15379
Residue:
428
  
Inhibitor
Name:
BDBM25162
Synonyms:
1-[5-(2,3-dihydro-1H-indol-1-ylcarbonyl)thiophen-2-yl]-2,2,2-trifluoroethan-1-one thiophene derivative, 3h
Type:
Small organic molecule
Emp. Form.:
C15H10F3NO2S
Mol. Mass.:
325.306
SMILES:
FC(F)(F)C(=O)c1ccc(s1)C(=O)N1CCc2ccccc12
: