Target
Disintegrin and metalloproteinase domain-containing protein 10
Ligand
BDBM50269000
Substrate
Meas. Tech.
ChEMBL_523762 (CHEMBL1008370)
IC50
58±n/a nM
Citation
 Burns, DMLi, YLShi, EHe, CXu, MZhuo, JZhang, CQian, DQLi, YWynn, RCovington, MBKatiyar, KMarando, CAFridman, JSScherle, PFriedman, SMetcalf, BYao, W Compelling P1 substituent affect on metalloprotease binding profile enables the design of a novel cyclohexyl core scaffold with excellent MMP selectivity and HER-2 sheddase inhibition. Bioorg Med Chem Lett 19:3525-30 (2009)  
Target
Name:
Disintegrin and metalloproteinase domain-containing protein 10
Synonyms:
ADA10_HUMAN Disintegrin and metalloproteinase domain-containing protein 10 (ADAM10) MADM
Type:
Enzyme
Mol. Mass.:
84160.93
Organism:
Homo sapiens (Human)
Description:
O14672
Residue:
748
  
Inhibitor
Name:
BDBM50269000
Synonyms:
(1S,2S,5RS)-N-hydroxy-5-(2-oxo-2-(piperidin-1-yl)ethyl)-2-(4-phenylpiperazine-1-carbonyl)cyclohexanecarboxamide | CHEMBL497026
Type:
Small organic molecule
Emp. Form.:
C25H36N4O4
Mol. Mass.:
456.5777
SMILES:
ONC(=O)[C@H]1CC(CC(=O)N2CCCCC2)CC[C@@H]1C(=O)N1CCN(CC1)c1ccccc1
: