Target
Beta-1 adrenergic receptor
Ligand
BDBM50268077
Substrate
Meas. Tech.
ChEMBL_520027 (CHEMBL952691)
EC50
3±n/a nM
Citation
 Marquis, RWLago, AMCallahan, JFTrout, REGowen, MDelMar, EGVan Wagenen, BCLogan, SShimizu, SFox, JNemeth, EFYang, ZRoethke, TSmith, BRWard, KWLee, JKeenan, RMBhatnagar, P Antagonists of the calcium receptor I. Amino alcohol-based parathyroid hormone secretagogues. J Med Chem 52:3982-93 (2009)  
Target
Name:
Beta-1 adrenergic receptor
Synonyms:
ADRB1 ADRB1_HUMAN Beta-1 adrenoceptor | adrenergic Beta1
Type:
G Protein-Coupled Receptor (GPCR)
Mol. Mass.:
51338.40
Organism:
Homo sapiens (Human)
Description:
P08588
Residue:
477
  
Inhibitor
Name:
BDBM50268077
Synonyms:
(S)-4-(2-hydroxy-3-(1-(4-methoxyphenyl)-2-methylpropan-2-ylamino)propoxy)-1H-benzo[d]imidazol-2(3H)-one | CHEMBL486278
Type:
Small organic molecule
Emp. Form.:
C21H27N3O4
Mol. Mass.:
385.4568
SMILES:
COc1ccc(CC(C)(C)NC[C@H](O)COc2cccc3[nH]c(=O)[nH]c23)cc1
: