Target
72 kDa type IV collagenase
Ligand
BDBM50289127
Substrate
Meas. Tech.
ChEBML_101928
Ki
5.7±n/a nM
Citation
 Chapman, KTDurette, PLCaldwell, CGSperow, KMNiedzwiecki, LMHarrison, RKSaphos, CChristen, AJOlszewski, JMMoore, VLMacCoss, MHagmann, WK Orally active inhibitors of stromelysin-1 (MMP-3) Bioorg Med Chem Lett 6:803-806 (1996)    Article 
Target
Name:
72 kDa type IV collagenase
Synonyms:
72 kDa gelatinase CLG4A Gelatinase A (MMP-2) MMP2_HUMAN Matrix metalloproteinase-2 (MMP 2) Matrix metalloproteinases 2 (MMP-2) | TBE-1
Type:
Enzyme
Mol. Mass.:
73870.36
Organism:
Homo sapiens (Human)
Description:
P08253
Residue:
660
  
Inhibitor
Name:
BDBM50289127
Synonyms:
(2S,4R)-4-(3-Methyl-1-phenylcarbamoyl-butylcarbamoyl)-2-[4-(1-oxo-1,3-dihydro-isoindol-2-yl)-butyl]-6-(4-propyl-phenyl)-hexanoic acid | CHEMBL168150
Type:
Small organic molecule
Emp. Form.:
C40H51N3O5
Mol. Mass.:
653.85
SMILES:
CCCc1ccc(CC[C@H](C[C@H](CCCCN2Cc3ccccc3C2=O)C(O)=O)C(=O)N[C@@H](CC(C)C)C(=O)Nc2ccccc2)cc1
: