Target
Prothrombin
Ligand
BDBM50084682
Substrate
Meas. Tech.
ChEBML_208719
Ki
0.210000±n/a nM
Citation
 Quan, MLWityak, JDominguez, CDuncia, JVKettner, CAEllis, CDLiauw, AYPark, JMSantella, JBKnabb, RMThoolen, MJWeber, PCWexler, RR Biaryl substituted alkylboronate esters as thrombin inhibitors Bioorg Med Chem Lett 7:1595-1600 (1997)    Article 
Target
Name:
Prothrombin
Synonyms:
Activation peptide fragment 1 Coagulation factor II Prothrombin precursor Thrombin heavy chain | Thrombin light chain
Type:
Protein
Mol. Mass.:
70029.57
Organism:
Homo sapiens (Human)
Description:
P00734
Residue:
622
  
Inhibitor
Name:
BDBM50084682
Synonyms:
1-[3-(4-Carbamimidoyl-phenyl)-2-(2-methyl-1,2,3,4-tetrahydro-isoquinoline-7-sulfonylamino)-propionyl]-4-methyl-1,2,3,6-tetrahydro-pyridine-2-carboxylic acid CHEMBL40854
Type:
Small organic molecule
Emp. Form.:
C33H48BN5O5S
Mol. Mass.:
637.641
SMILES:
Cc1cc(ccc1C(=O)N[C@@H](CCCNC(N)=N)B1O[C@@H]2CC3CC(C3(C)C)[C@]2(C)O1)-c1ccccc1S(=O)(=O)NC(C)(C)C
: