Target
Nitric oxide synthase, brain
Ligand
BDBM50290810
Substrate
Meas. Tech.
ChEBML_143347
IC50
50000±n/a nM
Citation
 Shankaran, KDonnelly, KLShah, SKHumes, JLPacholok, SGGrant, SKGreen, BGMacCoss, M Inhibition of nitric oxide synthase by benzoxazolones Bioorg Med Chem Lett 7:2887-2892 (1997)    Article 
Target
Name:
Nitric oxide synthase, brain
Synonyms:
Constitutive NOS NC-NOS NOS type I nNOS NOS1_HUMAN Neuronal nitric oxide synthase Nitric oxide synthase, neuronal (nNOS) bNOS | nNOS
Type:
Homodimer
Mol. Mass.:
160985.98
Organism:
Homo sapiens (Human)
Description:
P29475
Residue:
1434
  
Inhibitor
Name:
BDBM50290810
Synonyms:
5-Methyl-3H-benzooxazol-2-one | CHEMBL101439
Type:
Small organic molecule
Emp. Form.:
C8H7NO2
Mol. Mass.:
149.1467
SMILES:
Cc1ccc2oc(=O)[nH]c2c1
: