Target
Maltase-glucoamylase
Ligand
BDBM50291032
Substrate
Meas. Tech.
ChEBML_70932
Ki
1000±n/a nM
Citation
 Lesur, BDucep, JBLalloz, MNEhrhard, ADanzin, C New deoxynojirimycin derivatives as potent inhibitors of intestinal α-glucohydrolases Bioorg Med Chem Lett 7:355-360 (1997)    Article 
Target
Name:
Maltase-glucoamylase
Synonyms:
Alpha glucosidase Glucan 1,4-alpha-glucosidase MGAM MGA_HUMAN Maltase-glucoamylase, intestinal | Synonyms=MGA
Type:
Enzyme
Mol. Mass.:
209817.06
Organism:
Homo sapiens (Human)
Description:
O43451
Residue:
2753
  
Inhibitor
Name:
BDBM50291032
Synonyms:
(2R,3R,4R,5S)-2-Hydroxymethyl-1-(3-trimethylsilanyl-benzyl)-piperidine-3,4,5-triol | CHEMBL121223
Type:
Small organic molecule
Emp. Form.:
C16H27NO4Si
Mol. Mass.:
325.4754
SMILES:
C[Si](C)(C)c1cccc(CN2C[C@H](O)[C@@H](O)[C@H](O)[C@H]2CO)c1
: