Target
Hexokinase-4
Ligand
BDBM50294866
Substrate
Meas. Tech.
ChEMBL_576767 (CHEMBL1032034)
EC50
1500±n/a nM
Citation
 Iino, THashimoto, NSasaki, KOhyama, SYoshimoto, RHosaka, HHasegawa, TChiba, MNagata, YEiki, JNishimura, T Structure-activity relationships of 3,5-disubstituted benzamides as glucokinase activators with potent in vivo efficacy. Bioorg Med Chem 17:3800-9 (2009)  
Target
Name:
Hexokinase-4
Synonyms:
GCK Glucokinase (GK) HK IV HXK4_HUMAN Hexokinase-D
Type:
Enzyme
Mol. Mass.:
52175.81
Organism:
Homo sapiens (Human)
Description:
P35557
Residue:
465
  
Inhibitor
Name:
BDBM50294866
Synonyms:
(+/-)-3-(2-Amino-1-methylethoxy)-5-[4-(methylsulfonyl)phenoxy]-N-1,3-thiazol-2-ylbenzamide | CHEMBL561049
Type:
Small organic molecule
Emp. Form.:
C20H21N3O5S2
Mol. Mass.:
447.528
SMILES:
CC(CN)Oc1cc(Oc2ccc(cc2)S(C)(=O)=O)cc(c1)C(=O)Nc1nccs1
: