Target
Prostaglandin E2 receptor EP3 subtype
Ligand
BDBM50414547
Substrate
Meas. Tech.
ChEMBL_581537 (CHEMBL1059840)
Ki
1.26±n/a nM
Citation
 Hilfiker, MAWang, NHou, XDu, ZPullen, MANord, MNagilla, RFries, HEWu, CWSulpizio, ACJaworski, JPMorrow, DEdwards, RMJin, J Discovery of novel aminothiadiazole amides as selective EP(3) receptor antagonists. Bioorg Med Chem Lett 19:4292-5 (2009)  
Target
Name:
Prostaglandin E2 receptor EP3 subtype
Synonyms:
PE2R3_HUMAN PGE2-R Prostaglandin E2 receptor Prostaglandin E2 receptor EP3 subtype (EP3) Prostaglandin E2 receptor EP3D subtype (EP3D) | Prostanoid EP3 receptor
Type:
Enzyme
Mol. Mass.:
43335.03
Organism:
Homo sapiens (Human)
Description:
P43115
Residue:
390
  
Inhibitor
Name:
BDBM50414547
Synonyms:
CHEMBL558644
Type:
Small organic molecule
Emp. Form.:
C18H14Cl2N4O2S
Mol. Mass.:
421.3
SMILES:
CN1CCOc2ccc(cc12)C(=O)Nc1nnc(s1)-c1c(Cl)cccc1Cl
: