Target
Histamine H1 receptor
Ligand
BDBM50297304
Substrate
Meas. Tech.
ChEMBL_582981 (CHEMBL1051819)
Ki
0.6±n/a nM
Citation
 Moree, WJLi, BFJovic, FCoon, TYu, JGross, RSTucci, FMarinkovic, DZamani-Kord, SMalany, SBradbury, MJHernandez, LMO'Brien, ZWen, JWang, HHoare, SRPetroski, RESacaan, AMadan, ACrowe, PDBeaton, G Characterization of novel selective H1-antihistamines for clinical evaluation in the treatment of insomnia. J Med Chem 52:5307-10 (2009)  
Target
Name:
Histamine H1 receptor
Synonyms:
H1R HISTAMINE H1 HRH1_HUMAN
Type:
G Protein-Coupled Receptor (GPCR)
Mol. Mass.:
55808.72
Organism:
Homo sapiens (Human)
Description:
Cell pellets from SK-N-MC cells transfected with human H1 receptor were used in binding assay.
Residue:
487
  
Inhibitor
Name:
BDBM50297304
Synonyms:
CHEMBL560741 | {2-[3-(4-Fluoro-benzyl)-1H-inden-2-yl]-ethyl}-dimethyl-amine
Type:
Small organic molecule
Emp. Form.:
C20H22FN
Mol. Mass.:
295.3938
SMILES:
CN(C)CCC1=C(Cc2ccc(F)cc2)c2ccccc2C1
: