Target
Sodium-dependent noradrenaline transporter
Ligand
BDBM50300530
Substrate
Meas. Tech.
ChEMBL_592526 (CHEMBL1044082)
IC50
49±n/a nM
Citation
 Mahaney, PEKim, CYCoghlan, RDCohn, STHeffernan, GDHuselton, CATerefenko, EAVu, ATZhang, PBurroughs, KDCosmi, SABray, JAJohnston, GHDeecher, DCTrybulski, EJ Structure-activity relationships of the 1-amino-3-(1H-indol-1-yl)-3-phenylpropan-2-ol series of monoamine reuptake inhibitors. Bioorg Med Chem Lett 19:5807-10 (2009)  
Target
Name:
Sodium-dependent noradrenaline transporter
Synonyms:
Monoamine transporter NET Noradrenaline Transporter (NET) Norepinephrine transporter protein (NET) SLC6A2 Sodium-dependent noradrenaline transporter (NET) | Solute carrier family 6 member 2
Type:
Multi-pass membrane protein
Mol. Mass.:
69337.72
Organism:
Homo sapiens (Human)
Description:
P23975
Residue:
617
  
Inhibitor
Name:
BDBM50300530
Synonyms:
(1S,2R)-1-(1H-indol-1-yl)-3-(methylamino)-1-m-tolylpropan-2-ol | CHEMBL577825
Type:
Small organic molecule
Emp. Form.:
C19H22N2O
Mol. Mass.:
294.3908
SMILES:
CNC[C@@H](O)[C@H](c1cccc(C)c1)n1ccc2ccccc12
: