Target
DNA-(apurinic or apyrimidinic site) endonuclease
Ligand
BDBM50303966
Substrate
Meas. Tech.
ChEMBL_595225 (CHEMBL1043577)
IC50
4000±n/a nM
Citation
 Nyland, RLLuo, MKelley, MRBorch, RF Design and synthesis of novel quinone inhibitors targeted to the redox function of apurinic/apyrimidinic endonuclease 1/redox enhancing factor-1 (Ape1/ref-1). J Med Chem 53:1200-10 (2010)  
Target
Name:
DNA-(apurinic or apyrimidinic site) endonuclease
Synonyms:
APE APEX APEX1_HUMAN Apurinic-apyrimidinic endonuclease 1 (APE-1) DNA-(apurinic or apyrimidinic site) lyase REF1
Type:
Protein
Mol. Mass.:
35560.12
Organism:
Homo sapiens (Human)
Description:
P27695
Residue:
318
  
Inhibitor
Name:
BDBM50303966
Synonyms:
(E)-3-(3-Fluoro-1,4-naphthoquinon-2-yl)-2-methylpropenoic Acid | CHEMBL570986
Type:
Small organic molecule
Emp. Form.:
C14H9FO4
Mol. Mass.:
260.2173
SMILES:
C\C(=C/C1=C(F)C(=O)c2ccccc2C1=O)C(O)=O
: