Target
Sodium-dependent serotonin transporter
Ligand
BDBM50309523
Substrate
Meas. Tech.
ChEMBL_609535 (CHEMBL1073788)
Ki
>4710±n/a nM
Citation
 Dounay, ABBarta, NSCampbell, BMColeman, CCollantes, EMDenny, LDutta, SGray, DLHou, DIyer, RMaiti, SNOrtwine, DFProbert, AStratman, NCSubedi, RWhisman, TXu, WZoski, K Design, synthesis, and pharmacological evaluation of phenoxy pyridyl derivatives as dual norepinephrine reuptake inhibitors and 5-HT1A partial agonists. Bioorg Med Chem Lett 20:1114-7 (2010)  
Target
Name:
Sodium-dependent serotonin transporter
Synonyms:
5-HT Transporter 5HTT SC6A4_HUMAN SLC6A4 Serotonin transporter (5HTT) Sodium-dependent serotonin transporter (SERT) | Solute carrier family 6 member 4
Type:
Multi-pass membrane protein
Mol. Mass.:
70322.51
Organism:
Homo sapiens (Human)
Description:
P31645
Residue:
630
  
Inhibitor
Name:
BDBM50309523
Synonyms:
1-(2-(2-chloro-6-fluorophenoxy)pyridin-3-yl)piperazine | CHEMBL599798
Type:
Small organic molecule
Emp. Form.:
C15H15ClFN3O
Mol. Mass.:
307.751
SMILES:
Fc1cccc(Cl)c1Oc1ncccc1N1CCNCC1
: