Target
Estrogen receptor beta
Ligand
BDBM50310384
Substrate
Meas. Tech.
ChEMBL_622100 (CHEMBL1114099)
IC50
18.6±n/a nM
Citation
 Jain, NXu, JKanojia, RMDu, FJian-Zhong, GPacia, ELai, MTMusto, AAllan, GReuman, MLi, XHahn, DCousineau, MPeng, SRitchie, DRussell, RLundeen, SSui, Z Identification and structure-activity relationships of chromene-derived selective estrogen receptor modulators for treatment of postmenopausal symptoms. J Med Chem 52:7544-69 (2009)  
Target
Name:
Estrogen receptor beta
Synonyms:
ER-beta ESR2_HUMAN Estradiol receptor beta (ERβ) Estrogen receptor (ER beta) Estrogen receptor beta (ER beta) NR3A2 estrogen beta
Type:
Protein
Mol. Mass.:
59238.43
Organism:
Homo sapiens (Human)
Description:
Q92731
Residue:
530
  
Inhibitor
Name:
BDBM50310384
Synonyms:
1-{2-[4-((S)-2,8-Dihydroxy-11,12-dihydro-5H-6,13-dioxa-benzo[3,4]cyclohepta[1,2-a]naphthalen-5-yl)-phenoxy]-ethyl}-pyrrolidine-2,5-dione | CHEMBL1088337
Type:
Small organic molecule
Emp. Form.:
C29H25NO7
Mol. Mass.:
499.5113
SMILES:
Oc1ccc2C3=C([C@@H](Oc2c1)c1ccc(OCCN2C(=O)CCC2=O)cc1)c1ccc(O)cc1OCC3
: