Target
Estrogen receptor
Ligand
BDBM50310386
Substrate
Meas. Tech.
ChEMBL_622101 (CHEMBL1114100)
IC50
55±n/a nM
Citation
 Jain, NXu, JKanojia, RMDu, FJian-Zhong, GPacia, ELai, MTMusto, AAllan, GReuman, MLi, XHahn, DCousineau, MPeng, SRitchie, DRussell, RLundeen, SSui, Z Identification and structure-activity relationships of chromene-derived selective estrogen receptor modulators for treatment of postmenopausal symptoms. J Med Chem 52:7544-69 (2009)  
Target
Name:
Estrogen receptor
Synonyms:
ER ESR ESR1_HUMAN Estrogen receptor Estrogen receptor (ER-alpha) Estrogen receptor alpha (ER) Nuclear receptor subfamily 3 group A member 1
Type:
Protein
Mol. Mass.:
66230.44
Organism:
Homo sapiens (Human)
Description:
P03372
Residue:
595
  
Inhibitor
Name:
BDBM50310386
Synonyms:
(S)-5-[4-(3-Piperidin-1-yl-propoxy)-phenyl]-11,12-dihydro-5H-6,13-dioxa-benzo[3,4]cyclohepta[1,2-a]naphthalene-2,8-diol | CHEMBL1087547
Type:
Small organic molecule
Emp. Form.:
C31H33NO5
Mol. Mass.:
499.5974
SMILES:
Oc1ccc2C3=C([C@@H](Oc2c1)c1ccc(OCCCN2CCCCC2)cc1)c1ccc(O)cc1OCC3
: