Target
Estrogen receptor
Ligand
BDBM50310392
Substrate
Meas. Tech.
ChEMBL_622102 (CHEMBL1114101)
IC50
150±n/a nM
Citation
 Jain, NXu, JKanojia, RMDu, FJian-Zhong, GPacia, ELai, MTMusto, AAllan, GReuman, MLi, XHahn, DCousineau, MPeng, SRitchie, DRussell, RLundeen, SSui, Z Identification and structure-activity relationships of chromene-derived selective estrogen receptor modulators for treatment of postmenopausal symptoms. J Med Chem 52:7544-69 (2009)  
Target
Name:
Estrogen receptor
Synonyms:
ER ESR ESR1_HUMAN Estrogen receptor Estrogen receptor (ER-alpha) Estrogen receptor alpha (ER) Nuclear receptor subfamily 3 group A member 1
Type:
Protein
Mol. Mass.:
66230.44
Organism:
Homo sapiens (Human)
Description:
P03372
Residue:
595
  
Inhibitor
Name:
BDBM50310392
Synonyms:
5S-(+)-[4-(2-piperidin-1-ylethoxy)phenyl]-11,12-dihydro-5H-6,13-dioxabenzo[3,4]cyclohepta[1,2-a]naphthalen-2-ol | CHEMBL1087426
Type:
Small organic molecule
Emp. Form.:
C30H31NO4
Mol. Mass.:
469.5714
SMILES:
Oc1ccc2C3=C(CCOc2c1)c1ccccc1O[C@H]3c1ccc(OCCN2CCCCC2)cc1
: