Target
Peroxisome proliferator-activated receptor alpha
Ligand
BDBM50312422
Substrate
Meas. Tech.
ChEMBL_620646 (CHEMBL1114854)
EC50
910±n/a nM
Citation
 Epple, RCow, CXie, YAzimioara, MRusso, RWang, XWityak, JKaranewsky, DSTuntland, TNguyêñ-Trân, VTCuc Ngo, CHuang, DSaez, ESpalding, TGerken, AIskandar, MSeidel, HMTian, SS Novel bisaryl substituted thiazoles and oxazoles as highly potent and selective peroxisome proliferator-activated receptor delta agonists. J Med Chem 53:77-105 (2010)  
Target
Name:
Peroxisome proliferator-activated receptor alpha
Synonyms:
NR1C1 PPAR PPAR-alpha PPARA_HUMAN Peroxisome proliferator-activated receptor | Peroxisome proliferator-activated receptor alpha (PPAR alpha)
Type:
Enzyme
Mol. Mass.:
52222.08
Organism:
Homo sapiens (Human)
Description:
Q07869
Residue:
468
  
Inhibitor
Name:
BDBM50312422
Synonyms:
2-(4-((4-(4-(Cyclopentyloxy)phenyl)-5-(4-(trifluoromethoxy)-phenyl)oxazol-2-yl)methoxy)-2-methylphenoxy)acetic Acid | CHEMBL1075683
Type:
Small organic molecule
Emp. Form.:
C31H28F3NO7
Mol. Mass.:
583.5517
SMILES:
Cc1cc(OCc2nc(c(o2)-c2ccc(OC(F)(F)F)cc2)-c2ccc(OC3CCCC3)cc2)ccc1OCC(O)=O
: