Target
Amyloid-beta precursor protein
Ligand
BDBM50314996
Substrate
Meas. Tech.
ChEMBL_624431 (CHEMBL1108759)
EC50
13600±n/a nM
Citation
 Malamas, MSBarnes, KHui, YJohnson, MLovering, FCondon, JFobare, WSolvibile, WTurner, JHu, YManas, ESFan, KOlland, AChopra, RBard, JPangalos, MNReinhart, PRobichaud, AJ Novel pyrrolyl 2-aminopyridines as potent and selective human beta-secretase (BACE1) inhibitors. Bioorg Med Chem Lett 20:2068-73 (2010)  
Target
Name:
Amyloid-beta precursor protein
Synonyms:
A4 ABPP AICD-50 AICD-59 AID(57) APP Alzheimer disease amyloid protein Amyloid beta Protein Amyloid beta protein Abeta(1-42) Amyloid intracellular domain 57 Amyloid protein (Abeta42b) Beta amyloid A4 protein Beta-APP42 Beta-amyloid protein 42 C83 CVAP Gamma Secretase Gamma-CTF(57) Gamma-secretase Gamma-secretase C-terminal fragment 57 P3(40) PN-II Protease nexin-II S-APP-beta Soluble APP-beta | beta-Amyloid Precursor Protein (APP)
Type:
Single-pass type I membrane protein
Mol. Mass.:
86890.41
Organism:
Homo sapiens (Human)
Description:
P05067
Residue:
770
  
Inhibitor
Name:
BDBM50314996
Synonyms:
2-(2-amino-6-((2-(2-chlorophenyl)-5-(4-(pentyloxy)phenyl)-1H-pyrrol-1-yl)methyl)pyridin-3-yloxy)ethanol | CHEMBL1093807
Type:
Small organic molecule
Emp. Form.:
C29H32ClN3O3
Mol. Mass.:
506.036
SMILES:
CCCCCOc1ccc(cc1)-c1ccc(-c2ccccc2Cl)n1Cc1ccc(OCCO)c(N)n1
: