Target
Acetylcholinesterase
Ligand
BDBM50317178
Substrate
Meas. Tech.
ChEMBL_631311 (CHEMBL1103849)
IC50
1.2±n/a nM
Citation
 Rook, YSchmidtke, KUGaube, FSchepmann, DWünsch, BHeilmann, JLehmann, JWinckler, T Bivalent beta-carbolines as potential multitarget anti-Alzheimer agents. J Med Chem 53:3611-7 (2010)  
Target
Name:
Acetylcholinesterase
Synonyms:
ACES_ELEEL Acetylcholinesterase (EeAChE) | ache
Type:
Enzyme
Mol. Mass.:
71812.79
Organism:
Electrophorus electricus (Electric eel)
Description:
Residue:
633
  
Inhibitor
Name:
BDBM50317178
Synonyms:
2-Methyl-9-[12-(2-methyl-beta-carboline-9-yl)dodecyl]-beta-carboline-2-ium iodide | CHEMBL1096994
Type:
Small organic molecule
Emp. Form.:
C36H44N4
Mol. Mass.:
532.7603
SMILES:
C[n+]1ccc2c(c1)n(CCCCCCCCCCCCn1c3ccccc3c3cc[n+](C)cc13)c1ccccc21
: