Target
Adenosine receptor A3
Ligand
BDBM50317876
Substrate
Meas. Tech.
ChEMBL_630180 (CHEMBL1117283)
Ki
8560±n/a nM
Citation
 Devine, SMGregg, AFigler, HMcIntosh, KUrmaliya, VLinden, JPouton, CWWhite, PJBottle, SEScammells, PJ Synthesis and evaluation of new N6-substituted adenosine-5'-N-methylcarboxamides as A3 adenosine receptor agonists. Bioorg Med Chem 18:3078-87 (2010)  
Target
Name:
Adenosine receptor A3
Synonyms:
A3 adenosine receptor (hA3) ADORA3 | Adenosine A3 receptor (A3AR)
Type:
G Protein-Coupled Receptor (GPCR)
Mol. Mass.:
36197.32
Organism:
Homo sapiens (Human)
Description:
P0DMS8
Residue:
318
  
Inhibitor
Name:
BDBM50317876
Synonyms:
(2R,3R,4S,5R)-2-(6-(1-hydroxy-2,2,6,6-tetramethylpiperidin-4-ylamino)-1H-purin-9(6H)-yl)-5-(hydroxymethyl)tetrahydrofuran-3,4-diol | CHEMBL1094353
Type:
Small organic molecule
Emp. Form.:
C19H32N6O5
Mol. Mass.:
424.4946
SMILES:
CC1(C)CC(CC(C)(C)N1O)NC1NC=Nc2c1ncn2[C@@H]1O[C@H](CO)[C@@H](O)[C@H]1O
: