Target
Ectonucleotide pyrophosphatase/phosphodiesterase family member 2
Ligand
BDBM50148348
Substrate
Meas. Tech.
ChEMBL_642245 (CHEMBL1176954)
IC50
442±n/a nM
Citation
 Albers, HMvan Meeteren, LAEgan, DAvan Tilburg, EWMoolenaar, WHOvaa, H Discovery and optimization of boronic acid based inhibitors of autotaxin. J Med Chem 53:4958-67 (2010)  
Target
Name:
Ectonucleotide pyrophosphatase/phosphodiesterase family member 2
Synonyms:
ATX Autotaxin (ATX) ENPP2 Ectonucleotide Pyrophosphatase/Phosphodiesterase 2 (ENPP2) Extracellular lysophospholipase D PDNP2
Type:
Enzyme
Mol. Mass.:
99007.13
Organism:
Homo sapiens (Human)
Description:
Q13822
Residue:
863
  
Inhibitor
Name:
BDBM50148348
Synonyms:
(R)-Octadec-9-enoic acid 2-hydroxy-3-phosphonooxy-propyl ester CHEMBL117021 | lysophosphatidic acid
Type:
Small organic molecule
Emp. Form.:
C21H41O7P
Mol. Mass.:
436.5198
SMILES:
CCCCCCCC\C=C/CCCCCCCC(=O)OC[C@@H](O)COP(O)(O)=O
: