Target
Cathepsin K
Ligand
BDBM50323256
Substrate
Meas. Tech.
ChEMBL_643890 (CHEMBL1211789)
IC50
>10000±n/a nM
Citation
 Cai, JBaugh, MBlack, DLong, CJonathan Bennett, DDempster, MFradera, XGillespie, JAndrews, FBoucharens, SBruin, JCameron, KSCumming, IHamilton, WJones, PSKaptein, AKinghorn, EMaidment, MMartin, IMitchell, ARankovic, ZRobinson, JScullion, PUitdehaag, JCVink, PWestwood, Pvan Zeeland, Mvan Berkom, LBastiani, MMeulemans, T 6-Phenyl-1H-imidazo[4,5-c]pyridine-4-carbonitrile as cathepsin S inhibitors. Bioorg Med Chem Lett 20:4350-4 (2010)  
Target
Name:
Cathepsin K
Synonyms:
CATK_HUMAN CTSO Cathepsin O Cathepsin X
Type:
Enzyme
Mol. Mass.:
36975.68
Organism:
Homo sapiens (Human)
Description:
P43235
Residue:
329
  
Inhibitor
Name:
BDBM50323256
Synonyms:
1-methyl-6-(4-(pyridin-3-ylmethoxy)-3-(trifluoromethyl)phenyl)-1H-imidazo[4,5-c]pyridine-4-carbonitrile | CHEMBL1208976
Type:
Small organic molecule
Emp. Form.:
C21H14F3N5O
Mol. Mass.:
409.364
SMILES:
Cn1cnc2c(nc(cc12)-c1ccc(OCc2cccnc2)c(c1)C(F)(F)F)C#N
: