Target
Cathepsin S
Ligand
BDBM50323269
Substrate
Meas. Tech.
ChEMBL_643889 (CHEMBL1211788)
IC50
200±n/a nM
Citation
 Cai, JBaugh, MBlack, DLong, CJonathan Bennett, DDempster, MFradera, XGillespie, JAndrews, FBoucharens, SBruin, JCameron, KSCumming, IHamilton, WJones, PSKaptein, AKinghorn, EMaidment, MMartin, IMitchell, ARankovic, ZRobinson, JScullion, PUitdehaag, JCVink, PWestwood, Pvan Zeeland, Mvan Berkom, LBastiani, MMeulemans, T 6-Phenyl-1H-imidazo[4,5-c]pyridine-4-carbonitrile as cathepsin S inhibitors. Bioorg Med Chem Lett 20:4350-4 (2010)  
Target
Name:
Cathepsin S
Synonyms:
CATS_HUMAN Cathepsin S (Cat S) | cathepsin S preproprotein
Type:
Protein
Mol. Mass.:
37507.38
Organism:
Homo sapiens (Human)
Description:
P25774
Residue:
331
  
Inhibitor
Name:
BDBM50323269
Synonyms:
6-(4-propoxy-3-(trifluoromethyl)phenyl)-1H-imidazo[4,5-c]pyridine-4-carbonitrile | CHEMBL1209858
Type:
Small organic molecule
Emp. Form.:
C17H13F3N4O
Mol. Mass.:
346.3065
SMILES:
CCCOc1ccc(cc1C(F)(F)F)-c1cc2nc[nH]c2c(n1)C#N
: