Target
Kynurenine/alpha-aminoadipate aminotransferase, mitochondrial
Ligand
BDBM50324539
Substrate
Meas. Tech.
ChEMBL_649389 (CHEMBL1219087)
IC50
910±n/a nM
Citation
 Rossi, FValentina, CGaravaglia, SSathyasaikumar, KVSchwarcz, RKojima, SOkuwaki, KOno, SKajii, YRizzi, M Crystal structure-based selective targeting of the pyridoxal 5'-phosphate dependent enzyme kynurenine aminotransferase II for cognitive enhancement. J Med Chem 53:5684-9 (2010)  
Target
Name:
Kynurenine/alpha-aminoadipate aminotransferase, mitochondrial
Synonyms:
2-aminoadipate aminotransferase AADAT Alpha-aminoadipate aminotransferase KAT2 Kynurenine aminotransferase II Kynurenine--oxoglutarate aminotransferase II Kynurenine--oxoglutarate transaminase II
Type:
Enzyme
Mol. Mass.:
47353.09
Organism:
Homo sapiens (Human)
Description:
Q8N5Z0
Residue:
425
  
Inhibitor
Name:
BDBM50324539
Synonyms:
(S)-(-)-9-(4-aminopiperazin-1-yl)-8-fluoro-3-methyl-6-oxo-2,3-dihydro-6H-1-oxa-3a-azaphenalene-5-carboxylic acid | CHEMBL1215659
Type:
Small organic molecule
Emp. Form.:
C17H19FN4O4
Mol. Mass.:
362.3556
SMILES:
C[C@H]1COc2c(N3CCN(N)CC3)c(F)cc3c2n1cc(C(O)=O)c3=O
: