Target
Prostaglandin G/H synthase 2
Ligand
BDBM50326533
Substrate
Meas. Tech.
ChEMBL_658294 (CHEMBL1246851)
IC50
36800±n/a nM
Citation
 Harrak, YCasula, GBasset, JRosell, GPlescia, SRaffa, DCusimano, MGPouplana, RPujol, MD Synthesis, anti-inflammatory activity, and in vitro antitumor effect of a novel class of cyclooxygenase inhibitors: 4-(aryloyl)phenyl methyl sulfones. J Med Chem 53:6560-71 (2010)  
Target
Name:
Prostaglandin G/H synthase 2
Synonyms:
COX2 Cyclooxygenase-2 (COX-2) PTGS2 Prostaglandin G/H synthase (cyclooxygenase)
Type:
Protein
Mol. Mass.:
68976.98
Organism:
Ovis aries (Sheep)
Description:
Residue:
603
  
Inhibitor
Name:
BDBM50326533
Synonyms:
(1-methyl-1H-indol-3-yl)(4-(methylsulfonyl)phenyl)methanone | CHEMBL1243065
Type:
Small organic molecule
Emp. Form.:
C17H15NO3S
Mol. Mass.:
313.371
SMILES:
Cn1cc(C(=O)c2ccc(cc2)S(C)(=O)=O)c2ccccc12
: